{"text_format":"1","workbook":"xlsx","n_sheets":11,"sheets":["Finish Times (2)","Fleet 1","Fleet 2","Fleet 3","Fleet 4","Harbor 20 Fleet 7","Spring Series Scoring Summary","Fall Series Scoring Summary","Season Series Scoring Summary","Fleet 1 and 2 Combo","Fleet 3 and 4 Combo"],"not_rendered":{"charts":0,"images":1,"macros":1,"external_links":0,"defined_names":7,"comments":4,"pivot_tables":0},"unopened":[],"bounds":{"document_bytes":16777216,"sheet_cells":100000,"rows_first":2000,"rows_last":500,"rows_between":2000,"halvings":0,"cell_chars":16384,"cell_head_chars":4096},"cells_cut":0,"cells_raw":0,"read":"whole","date_system":"1900"}

{"sheet":"Finish Times (2)","index":0,"n_rows":39,"n_cols":7,"rows_kept":39,"cut":false,"hidden":true,"merged":[]}
[]
[]
[]
["MUST",null,"FLEET 1"]
["BE",null,"FLEET 2"]
["IN ALPHA",null,"FLEET 3"]
["ORDER",null,"FLEET 4"]
[null,null,null,null,null,"Finish Time"]
["BOAT NAME","FLEET","BOAT","SAIL #","SKIPPER","MINUTES","SECONDS"]
["Bandit",1,"J/24",2792,"Cliborne"]
{"$rows_left_out":30}
{"sheet":"Fleet 1","index":1,"n_rows":84,"n_cols":18,"rows_kept":84,"cut":false,"hidden":false,"merged":[[74,0,74,14],[75,5,75,8],[76,0,76,14],[77,6,77,7],[77,8,77,9],[77,10,77,11],[64,0,64,14],[65,5,65,8],[66,0,66,14],[67,6,67,7],[67,8,67,9],[67,10,67,11],[54,0,54,14],[55,5,55,8],[56,0,56,14],[57,6,57,7],[57,8,57,9],[57,10,57,11],[44,0,44,14],[45,5,45,8],[46,0,46,14],[47,6,47,7],[47,8,47,9],[47,10,47,11],[34,0,34,14],[35,5,35,8],[36,0,36,14],[37,6,37,7],[37,8,37,9],[37,10,37,11],[24,0,24,14],[25,5,25,8],[26,0,26,14],[27,6,27,7],[27,8,27,9],[27,10,27,11],[14,0,14,14],[15,5,15,8],[16,0,16,14],[17,6,17,7],[17,8,17,9],[17,10,17,11],[4,0,4,14],[6,0,6,14],[7,6,7,7],[7,8,7,9],[7,10,7,11],[5,5,5,8]]}
["Control Z to run macro"]
[]
[{"$f":"#REF!","v":{"$error":"#REF!"}},"<-----Minutes after first start"]
[]
["Blackwater Yacht Racing Association - Race Results - Fleet 1"]
[null,null,null,"Date: ","2019-09-07","2019 Fall Series Race 1",null,null,null,null,"RC: Warren Theis"]
["I & II W/L twice around, III & IV W/L Once around.  Wind light and shifty 4 to 8 mph",null,null,null,null,null,null,null,null,null,null,null,null,null,null,"Time","Time","Approx"]
[null,null,null,null,null,null,"Handicap",null,"TCF",null,"Finish Time",null,"Calc(1)","Adj.(2)",null,"Behind","Behind","H'cap"]
["Skipper","Boat Name","Initials","Guest?","Boat","Sail #","Spin*","Non-Spin*","Spin*","Non-Spin*","Min.","Sec.","Min.dd","Time","Place","Winner","Boat Ahead","to win"]
["Cliborne","Bandit",null,null,"J/24",2792,170,185,0.93457943925233644,"",36,25,36.416666666666664,34.034267912772584,1,0,null,170]
{"$rows_left_out":75}
{"sheet":"Fleet 2","index":2,"n_rows":108,"n_cols":18,"rows_kept":108,"cut":false,"hidden":false,"merged":[[95,0,95,14],[96,5,96,8],[97,0,97,14],[98,6,98,7],[98,8,98,9],[98,10,98,11],[83,5,83,8],[84,0,84,14],[85,6,85,7],[85,8,85,9],[85,10,85,11],[82,0,82,14],[69,0,69,14],[70,5,70,8],[71,0,71,14],[72,6,72,7],[72,8,72,9],[72,10,72,11],[56,0,56,14],[57,5,57,8],[58,0,58,14],[59,6,59,7],[59,8,59,9],[59,10,59,11],[43,0,43,14],[44,5,44,8],[45,0,45,14],[46,6,46,7],[46,8,46,9],[46,10,46,11],[30,0,30,14],[31,5,31,8],[32,0,32,14],[33,6,33,7],[33,8,33,9],[33,10,33,11],[17,0,17,14],[18,5,18,8],[19,0,19,14],[20,6,20,7],[20,8,20,9],[20,10,20,11],[4,0,4,14],[6,0,6,14],[7,6,7,7],[7,8,7,9],[7,10,7,11],[5,5,5,8]]}
[]
[]
[{"$f":"#REF!","v":{"$error":"#REF!"}},"<-----Minutes after first start"]
[]
["Blackwater Yacht Racing Association - Race Results - Fleet 2"]
[null,null,null,"Date:","2019-09-07","2019 Fall Series Race 1",null,null,null,null,"RC: Warren Theis"]
["I & II W/L twice around, III & IV W/L Once around.  Wind light and shifty 4 to 8 mph",null,null,null,null,null,null,null,null,null,null,null,null,null,null,"Time","Time","Approx"]
[null,null,null,null,null,null,"Handicap",null,"TCF",null,"Finish Time",null,"Calc(1)","Adj.(2)",null,"Behind","Behind","H'cap"]
["Skipper","Boat Name","Initials","Guest?","Boat","Sail #","Spin*","Non-Spin*","Spin*","Non-Spin*","Min.","Sec.","Min.dd","Time","Place","Winner","Boat Ahead","to win"]
["Arnold","Sails Call",null,null,"Harbor 20",322,220,235,"",0.88105726872246692,43,20,43.333333333333336,38.179148311306903,1,0,null,235]
{"$rows_left_out":99}
{"sheet":"Fleet 3","index":3,"n_rows":92,"n_cols":18,"rows_kept":92,"cut":false,"hidden":false,"merged":[[81,0,81,14],[82,5,82,8],[83,0,83,14],[84,6,84,7],[84,8,84,9],[84,10,84,11],[70,0,70,14],[71,5,71,8],[72,0,72,14],[73,6,73,7],[73,8,73,9],[73,10,73,11],[59,0,59,14],[60,5,60,8],[61,0,61,14],[62,6,62,7],[62,8,62,9],[62,10,62,11],[48,0,48,14],[49,5,49,8],[50,0,50,14],[51,6,51,7],[51,8,51,9],[51,10,51,11],[37,0,37,14],[38,5,38,8],[39,0,39,14],[40,6,40,7],[40,8,40,9],[40,10,40,11],[26,0,26,14],[27,5,27,8],[28,0,28,14],[29,6,29,7],[29,8,29,9],[29,10,29,11],[15,0,15,14],[16,5,16,8],[17,0,17,14],[18,6,18,7],[18,8,18,9],[18,10,18,11],[4,0,4,14],[6,0,6,14],[7,6,7,7],[7,8,7,9],[7,10,7,11],[5,5,5,8]]}
[]
[]
[{"$f":"#REF!","v":{"$error":"#REF!"}},"<-----Minutes after first start"]
[]
["Blackwater Yacht Racing Association - Race Results - Fleet 3"]
[null,null,null,null,"2019-09-07","2019 Fall Series Race 1",null,null,null,null,"RC: Warren Theis"]
["I & II W/L twice around, III & IV W/L Once around.  Wind light and shifty 4 to 8 mph",null,null,null,null,null,null,null,null,null,null,null,null,null,null,"Time","Time","Approx"]
[null,null,null,null,null,null,"Handicap",null,"TCF",null,"Finish Time",null,"Calc(1)","Adj.(2)",null,"Behind","Behind","H'cap"]
["Skipper","Boat Name","Initials","Guest?","Boat","Sail #","Spin*","Non-Spin*","Spin*","Non-Spin*","Min.","Sec.","Min.dd","Time","Place","Winner","Boat Ahead","to win"]
["Gobble","Always Something",null,null,"Hunter 23",1256,243,258,"",0.86355785837651122,34,52,29.866666666666667,25.791594703511802,2,4.0174011551247055,4.0174011551247055,472]
{"$rows_left_out":83}
{"sheet":"Fleet 4","index":4,"n_rows":76,"n_cols":18,"rows_kept":76,"cut":false,"hidden":false,"merged":[[67,0,67,14],[68,5,68,8],[69,0,69,14],[70,6,70,7],[70,8,70,9],[70,10,70,11],[58,0,58,14],[59,5,59,8],[60,0,60,14],[61,6,61,7],[61,8,61,9],[61,10,61,11],[49,0,49,14],[50,5,50,8],[51,0,51,14],[52,6,52,7],[52,8,52,9],[52,10,52,11],[40,0,40,14],[41,5,41,8],[42,0,42,14],[43,6,43,7],[43,8,43,9],[43,10,43,11],[31,0,31,14],[32,5,32,8],[33,0,33,14],[34,6,34,7],[34,8,34,9],[34,10,34,11],[22,0,22,14],[23,5,23,8],[24,0,24,14],[25,6,25,7],[25,8,25,9],[25,10,25,11],[13,0,13,14],[14,5,14,8],[15,0,15,14],[16,6,16,7],[16,8,16,9],[16,10,16,11],[4,0,4,14],[6,0,6,14],[7,6,7,7],[7,8,7,9],[7,10,7,11],[5,5,5,8]]}
[]
[]
[{"$f":"#REF!","v":{"$error":"#REF!"}},"<-----Minutes after first start"]
[]
["Blackwater Yacht Racing Association - Race Results - Fleet 4"]
[null,null,null,"Date:","2019-09-07","2019 Fall Series Race 1",null,null,null,null,"RC: Warren Theis"]
["I & II W/L twice around, III & IV W/L Once around.  Wind light and shifty 4 to 8 mph",null,null,null,null,null,null,null,null,null,null,null,null,null,null,"Time","Time","Approx"]
[null,null,null,null,null,null,"Handicap",null,"TCF",null,"Finish Time",null,"Calc(1)","Adj.(2)",null,"Behind","Behind","H'cap"]
["Skipper","Boat Name","Initials","Guest?","Boat","Sail #","Spin*","Non-Spin*","Spin*","Non-Spin*","Min.","Sec.","Min.dd","Time","Place","Winner","Boat Ahead","to win"]
["Oginz","Alarming",null,null,"S-2 9.2",505,189,204,"",0.90579710144927539,36,50,31.833333333333336,28.834541062801936,2,3.5652274278373319,3.5652274278373319,360]
{"$rows_left_out":67}
{"sheet":"Harbor 20 Fleet 7","index":5,"n_rows":96,"n_cols":15,"rows_kept":96,"cut":false,"hidden":false,"merged":[[88,6,88,7],[74,0,74,8],[76,0,76,8],[77,6,77,7],[85,0,85,8],[87,0,87,8],[66,6,66,7],[52,0,52,8],[54,0,54,8],[55,6,55,7],[63,0,63,8],[65,0,65,8],[41,0,41,8],[43,0,43,8],[44,6,44,7],[30,0,30,8],[32,0,32,8],[33,6,33,7],[22,6,22,7],[11,6,11,7],[8,0,8,8],[10,0,10,8],[19,0,19,8],[21,0,21,8]]}
[]
[]
[]
[]
[{"$f":"'Fleet 1'!A16","v":0},{"$f":"'Fleet 1'!B16","v":0},null,null,{"$f":"'Fleet 1'!E16","v":43715},{"$f":"'Fleet 1'!F16","v":"2019 Fall Series Race 2"},{"$f":"'Fleet 1'!G16","v":0},{"$f":"'Fleet 1'!H16","v":0},{"$f":"'Fleet 1'!I16","v":0},{"$f":"'Fleet 1'!J16","v":0},{"$f":"'Fleet 1'!K16","v":"RC: Warren Theis"},{"$f":"'Fleet 1'!L16","v":0},{"$f":"'Fleet 1'!M16","v":0},{"$f":"'Fleet 1'!N16","v":0},{"$f":"'Fleet 1'!O16","v":0}]
[{"$f":"'Fleet 1'!A17","v":"I & II W/L twice around, III & IV W/L Once around.  Wind light and shifty 4 to 8 mph"},{"$f":"'Fleet 1'!B17","v":0},null,null,{"$f":"'Fleet 1'!E17","v":0},{"$f":"'Fleet 1'!F17","v":0},{"$f":"'Fleet 1'!G17","v":0},{"$f":"'Fleet 1'!H17","v":0},{"$f":"'Fleet 1'!I17","v":0},{"$f":"'Fleet 1'!J17","v":0},{"$f":"'Fleet 1'!K17","v":0},{"$f":"'Fleet 1'!L17","v":0},{"$f":"'Fleet 1'!M17","v":0},{"$f":"'Fleet 1'!N17","v":0},{"$f":"'Fleet 1'!O17","v":0}]
[{"$f":"'Fleet 1'!A18","v":0},{"$f":"'Fleet 1'!B18","v":0},null,null,{"$f":"'Fleet 1'!E18","v":0},{"$f":"'Fleet 1'!F18","v":0},{"$f":"'Fleet 1'!G18","v":"Handicap"},{"$f":"'Fleet 1'!H18","v":0},{"$f":"'Fleet 1'!I18","v":"TCF"},{"$f":"'Fleet 1'!J18","v":0},{"$f":"'Fleet 1'!K18","v":"Finish Time"},{"$f":"'Fleet 1'!L18","v":0},{"$f":"'Fleet 1'!M18","v":"Calc(1)"},{"$f":"'Fleet 1'!N18","v":"Adj.(2)"},{"$f":"'Fleet 1'!O18","v":0}]
[{"$f":"'Fleet 1'!A19","v":"Skipper"},{"$f":"'Fleet 1'!B19","v":"Boat Name"},null,null,{"$f":"'Fleet 1'!E19","v":"Boat"},{"$f":"'Fleet 1'!F19","v":"Sail #"},{"$f":"'Fleet 1'!G19","v":"Spin*"},{"$f":"'Fleet 1'!H19","v":"Non-Spin*"},{"$f":"'Fleet 1'!I19","v":"Spin*"},{"$f":"'Fleet 1'!J19","v":"Non-Spin*"},{"$f":"'Fleet 1'!K19","v":"Min."},{"$f":"'Fleet 1'!L19","v":"Sec."},{"$f":"'Fleet 1'!M19","v":"Min.dd"},{"$f":"'Fleet 1'!N19","v":"Time"},{"$f":"'Fleet 1'!O19","v":"Place"}]
["Smith Mountain Lake Harbor 20 Fleet 7"]
["Date: ","2019-09-07",null,"2019 Fall Series Race 1",null,"RC: Warren Theis"]
{"$rows_left_out":87}
{"sheet":"Spring Series Scoring Summary","index":6,"n_rows":48,"n_cols":21,"rows_kept":48,"cut":false,"hidden":true,"merged":[[2,0,2,9],[13,0,13,9],[27,0,27,9],[39,0,39,9]]}
[]
[]
["Blackwater Yacht Racing Association - Race Results - Fleet 1"]
[]
[]
[null,null,null,"Race 1","Race 5","Race 6","Race 7","Race 8","MakeUp 1","MakeUp 2",null,"# of Races","Total","Throw","# of Races","Points","Average","Overall"]
["Skipper","Boat Name","Boat","Place","Place","Place","Place","Place","Place","Place",null,null,"Points","Out","Less Tout","Less Tout","Finish","Rank"]
["Cliborne","Bandit","J/24",1,1,2,2,1,1,"",null,{"$f":"COUNT(D8:J8)","v":6},{"$f":"SUM(D8:J8)","v":8},2,{"$f":"IF(N8>0,L8-1,L8)","v":5},{"$f":"M8-N8","v":6},{"$f":"P8/O8","v":1.2},{"$f":"RANK(Q8,Q$8:Q$12,1)","v":1},null,"ThrowOut"]
["Schaible","Spider","B25",2.75,4,3,"","",2,2,null,{"$f":"COUNT(D9:J9)","v":5},{"$f":"SUM(D9:J9)","v":13.75},0,{"$f":"IF(N9>0,L9-1,L9)","v":5},{"$f":"M9-N9","v":13.75},{"$f":"P9/O9","v":2.75},{"$f":"RANK(Q9,Q$8:Q$12,1)","v":3}]
["Forqurean","Dark Horse","J/24","",2,1,1,2,3,1,null,{"$f":"COUNT(D10:J10)","v":6},{"$f":"SUM(D10:J10)","v":10},3,{"$f":"IF(N10>0,L10-1,L10)","v":5},{"$f":"M10-N10","v":7},{"$f":"P10/O10","v":1.4},{"$f":"RANK(Q10,Q$8:Q$12,1)","v":2},null,"ThrowOut"]
{"$rows_left_out":39}
{"sheet":"Fall Series Scoring Summary","index":7,"n_rows":48,"n_cols":22,"rows_kept":48,"cut":false,"hidden":true,"merged":[[2,0,2,10],[13,0,13,10],[27,0,27,10],[39,0,39,10]]}
[]
[]
["Blackwater Yacht Racing Association -Fall Race Results - Fleet 1"]
[]
[]
[null,null,null,"Race 1","Race 2","Race 3","Race 4","Race 5","Race 6","Race 7","Race 8",null,"# of Races","Total","Throw","# of Races","Points","Average","Overall"]
["Skipper","Boat Name","Boat","Place","Place","Place","Place","Place","Place","Place","Place",null,null,"Points","Out","Less Tout","Less Tout","Finish","Rank"]
["Cliborne","Bandit","J/24",1,1,1,1,1,2,1,1,null,{"$f":"COUNTIF(D8:K8,\">0\")","v":8},{"$f":"SUM(D8:K8)","v":9},2,{"$f":"IF(O8>0,M8-1,M8)","v":7},{"$f":"N8-O8","v":7},{"$f":"IFERROR(Q8/P8,\"\")","v":1},{"$f":"IFERROR(RANK(R8,R$8:R$11,1),\"\")","v":1},null,"ThrowOut"]
["Schaible","Spider","B25",3,3,2,2,3,3,3,3,null,{"$f":"COUNTIF(D9:K9,\">0\")","v":8},{"$f":"SUM(D9:K9)","v":22},6,6,16,2.6666666666666665,{"$f":"IFERROR(RANK(R9,R$8:R$11,1),\"\")","v":4},null,"ThrowOut"]
["Forqurean","Dark Horse","J/24",2,2,"","",2,1,"","",null,{"$f":"COUNTIF(D10:K10,\">0\")","v":4},{"$f":"SUM(D10:K10)","v":7},null,4,7,1.75,2,null,"ThrowOut"]
{"$rows_left_out":39}
{"sheet":"Season Series Scoring Summary","index":8,"n_rows":49,"n_cols":26,"rows_kept":49,"cut":false,"hidden":true,"merged":[[28,0,28,25],[40,0,40,25],[2,0,2,25],[14,0,14,25]]}
[]
[]
["Blackwater Yacht Racing Association - Race Results - Fleet 1"]
[]
[]
[null,null,null,"SPRING","SPRING","SPRING","SPRING","SPRING","SPRING","SPRING","FALL","FALL","FALL","FALL","FALL","FALL","FALL","FALL",null,"SUMMARY","SUMMARY","SUMMARY","SUMMARY","SUMMARY","SUMMARY","SUMMARY"]
[null,null,null,"Race 1","Race 5","Race 6","Race 7","Race 8","MakeUp 1","MakeUp 2","Race 1","Race 2","Race 3","Race 4","Race 5","Race 6","Race 7","Race 8",null,"# of Races","Total","Throw","# of Races","Points","Average","Overall"]
["Skipper","Boat Name","Boat","Place","Place","Place","Place","Place","Place","Place","Place","Place","Place","Place","Place","Place","Place","Place",null,null,"Points","Out","Less Tout","Less Tout","Finish","Rank"]
["Cliborne","Bandit","J/24",1,1,2,2,1,1,"",{"$f":"'Fall Series Scoring Summary'!D8","v":1},{"$f":"'Fall Series Scoring Summary'!E8","v":1},{"$f":"'Fall Series Scoring Summary'!F8","v":1},{"$f":"'Fall Series Scoring Summary'!G8","v":1},{"$f":"'Fall Series Scoring Summary'!H8","v":1},{"$f":"'Fall Series Scoring Summary'!I8","v":2},{"$f":"'Fall Series Scoring Summary'!J8","v":1},{"$f":"'Fall Series Scoring Summary'!K8","v":1},null,{"$f":"COUNTIF(D9:R9,\">0\")","v":14},{"$f":"SUM(D9:R9)","v":17},4,12,{"$f":"U9-V9","v":13},{"$f":"IFERROR(X9/W9,\"\")","v":1.0833333333333333},{"$f":"IFERROR(RANK(Y9,Y$9:Y$13,1),\"\")","v":1}]
["Schaible","Spider","B25",2.75,4,3,"","",2,2,{"$f":"'Fall Series Scoring Summary'!D9","v":3},{"$f":"'Fall Series Scoring Summary'!E9","v":3},{"$f":"'Fall Series Scoring Summary'!F9","v":2},{"$f":"'Fall Series Scoring Summary'!G9","v":2},{"$f":"'Fall Series Scoring Summary'!H9","v":3},{"$f":"'Fall Series Scoring Summary'!I9","v":3},{"$f":"'Fall Series Scoring Summary'!J9","v":3},{"$f":"'Fall Series Scoring Summary'!K9","v":3},null,{"$f":"COUNTIF(D10:R10,\">0\")","v":13},{"$f":"SUM(D10:R10)","v":35.75},4,{"$f":"IF(V10>0,T10-1,T10)","v":12},31.75,2.6458333333333335,{"$f":"IFERROR(RANK(Y10,Y$9:Y$13,1),\"\")","v":2}]
{"$rows_left_out":40}
{"sheet":"Fleet 1 and 2 Combo","index":9,"n_rows":33,"n_cols":37,"rows_kept":33,"cut":false,"hidden":true,"merged":[[4,0,4,14],[6,0,6,14],[7,6,7,7],[7,8,7,9],[7,10,7,11],[5,5,5,8]]}
["Control Z to run macro",null,null,null,null,null,null,null,null,null,null,null,null,null,null,null,null,null,5,null,null,null,null,null,"Winner"]
[null,null,null,null,null,null,null,null,null,null,null,null,null,null,null,null,null,null,null,null,null,null,null,null,{"$f":"MIN(N10:N27)","v":0}]
[{"$f":"#REF!","v":{"$error":"#REF!"}},"<-----Minutes after first start"]
[]
["Blackwater Yacht Racing Association - Race Results Fleets I & 2",null,null,null,null,null,null,null,null,null,null,null,null,null,null,null,null,null,null,null,null,null,null,null,null,"Test"]
[null,null,null,"Date:",{"$f":"#REF!","v":{"$error":"#REF!"}},{"$f":"#REF!","v":{"$error":"#REF!"}},null,null,null,null,{"$f":"CONCATENATE(\"RC:\",\" \",#REF!)","v":{"$error":"#REF!"}},null,null,null,null,null,null,null,null,null,null,null,null,null,"new tcf =","should ="]
[{"$f":"#REF!","v":{"$error":"#REF!"}},null,null,null,null,null,null,null,null,null,null,null,null,null,null,"Time","Time","Approx",null,"Finish Calculations",null,null,null,null,"Winner Adj Time","Winner Adj Time",null,null,"# of Boats"]
[null,null,null,null,null,null,"Handicap",null,"TCF",null,"Finish Time",null,"Calc(1)","Adj.(2)",null,"Behind","Behind","H'cap",null,"S for Spin",null,null,null,null,"/observed",null,null,null,{"$f":"MAX(AC10:AC27)","v":10}]
["Skipper","Boat Name","Initials","Guest?","Boat","Sail #","Spin*","Non-Spin*","Spin*","Non-Spin*","Min.","Sec.","Min.dd","Time","Place","Winner","Boat Ahead","to win",null,"N for non"]
["Cliborne","Bandit",null,null,"J/24",2792,170,{"$f":"IFERROR(G10+15,\"\")","v":185},{"$f":"IF(T10 = \"s\",1000/(900+G10),\"\")","v":0.93457943925233644},{"$f":"IF(T10 =\"n\",1000/(900+H10),\"\")","v":""},{"$f":"IF($AK10>0,(VLOOKUP($B10,#REF!,6,FALSE)),\"\")","v":{"$error":"#REF!"}},{"$f":"IF($AK10>0,(VLOOKUP($B10,#REF!,7,FALSE)),\"\")","v":{"$error":"#REF!"}},{"$f":"IF(AK10>0,(K10+L10/60)-A$3,\" \")","v":{"$error":"#REF!"}},{"$f":"IFERROR(U10,\" \")","v":""},"",{"$f":"IFERROR(N10-$Y$2,\"\")","v":""},null,{"$f":"IFERROR(ROUND((1000/Y10)-900,0),\"\")","v":""},null,"s",{"$f":"IFERROR(IF(M10>0,IF(T10=\"s\",M10*I10,0)+IF(T10=\"n\",M10*J10,0),\" \"),\"\")","v":""},{"$f":"IFERROR(RANK(N10,$N$10:$N$27,1),\"\")","v":""},null,null,{"$f":"IFERROR($Y$2/M10,\"\")","v":""},{"$f":"IFERROR(M10*Y10,\"\")","v":""},null,1,1,0,null,null,null,55,39,null,{"$f":"(VLOOKUP($B10,#REF!,6,FALSE))","v":{"$error":"#REF!"}}]
{"$rows_left_out":24}
{"sheet":"Fleet 3 and 4 Combo","index":10,"n_rows":29,"n_cols":37,"rows_kept":29,"cut":false,"hidden":true,"merged":[[4,0,4,14],[6,0,6,14],[7,6,7,7],[7,8,7,9],[7,10,7,11],[5,5,5,8]]}
[null,null,null,null,null,null,null,null,null,null,null,null,null,null,null,null,null,null,6,null,null,null,null,null,"Winner"]
[null,null,null,null,null,null,null,null,null,null,null,null,null,null,null,null,null,null,null,null,null,null,null,null,{"$f":"MIN(N10:N23)","v":0}]
[{"$f":"#REF!","v":{"$error":"#REF!"}},"<-----Minutes after first start"]
[]
["Blackwater Yacht Racing Association - Race Results Fleets 3 & 4",null,null,null,null,null,null,null,null,null,null,null,null,null,null,null,null,null,null,null,null,null,null,null,null,"Test"]
[null,null,null,"Date:",{"$f":"#REF!","v":{"$error":"#REF!"}},{"$f":"#REF!","v":{"$error":"#REF!"}},null,null,null,null,{"$f":"CONCATENATE(\"RC:\",\" \",#REF!)","v":{"$error":"#REF!"}},null,null,null,null,null,null,null,null,null,null,null,null,null,"new tcf =","should ="]
[{"$f":"#REF!","v":{"$error":"#REF!"}},null,null,null,null,null,null,null,null,null,null,null,null,null,null,"Time","Time","Approx",null,"Finish Calculations",null,null,null,null,"Winner Adj Time","Winner Adj Time",null,null,"# of Boats"]
[null,null,null,null,null,null,"Handicap",null,"TCF",null,"Finish Time",null,"Calc(1)","Adj.(2)",null,"Behind","Behind","H'cap",null,"S for Spin",null,null,null,null,"/observed",null,null,null,{"$f":"MAX(AC10:AC23)","v":5}]
["Skipper","Boat Name","Initials","Guest?","Boat","Sail #","Spin*","Non-Spin*","Spin*","Non-Spin*","Min.","Sec.","Min.dd","Time","Place","Winner","Boat Ahead","to win",null,"N for non"]
["Gobble","Always Something",null,null,"Hunter 23",1256,243,{"$f":"IFERROR(G10+15,\"\")","v":258},{"$f":"IF(T10 = \"s\",1000/(900+G10),\"\")","v":""},{"$f":"IF(T10 =\"n\",1000/(900+H10),\"\")","v":0.86355785837651122},{"$f":"IF($AK10>0,(VLOOKUP($B10,#REF!,6,FALSE)),\"\")","v":{"$error":"#REF!"}},{"$f":"IF($AK10>0,(VLOOKUP($B10,#REF!,7,FALSE)),\"\")","v":{"$error":"#REF!"}},{"$f":"IF(AK10>0,(K10+L10/60)-A$3,\" \")","v":{"$error":"#REF!"}},{"$f":"IFERROR(U10,\" \")","v":""},"",{"$f":"IFERROR(N10-$Y$2,\"\")","v":""},0.52228106854719769,{"$f":"IFERROR(ROUND((1000/Y10)-900,0),\"\")","v":""},null,"n",{"$f":"IFERROR(IF(M10>0,IF(T10=\"s\",M10*I10,0)+IF(T10=\"n\",M10*J10,0),\" \"),\"\")","v":""},{"$f":"IFERROR(RANK(N10,$N$10:$N$23,1),\"\")","v":""},null,null,{"$f":"IFERROR($Y$2/M10,\"\")","v":""},{"$f":"IFERROR(M10*Y10,\"\")","v":""},null,1,3,4.306183562928247,0.52228106854719769,null,null,55,39,null,{"$f":"(VLOOKUP($B10,#REF!,6,FALSE))","v":{"$error":"#REF!"}}]
{"$rows_left_out":19}